{"text_format":"1","workbook":"xlsx","n_sheets":5,"sheets":["Instructions","Journey","FORM KVV 6 11","Tour Report","FareChart"],"not_rendered":{"charts":0,"images":1,"macros":1,"external_links":0,"defined_names":13,"comments":0,"pivot_tables":0},"unopened":[],"bounds":{"document_bytes":16777216,"sheet_cells":100000,"rows_first":2000,"rows_last":500,"rows_between":2000,"halvings":0,"cell_chars":16384,"cell_head_chars":4096},"cells_cut":0,"cells_raw":0,"read":"whole","date_system":"1900"}

{"sheet":"Instructions","index":0,"n_rows":11,"n_cols":2,"rows_kept":11,"cut":false,"hidden":false,"merged":[]}
[]
[]
[]
[null,"Enable macros"]
[null,"Unhide all sheets by clicking button \"unhide all sheets\" above"]
[null,"Password is vermams"]
[null,"Enter Journey details in sheet \"Journey\""]
[null,"TA bill is generated in sheet \"Form KVV 6 11\""]
[null,"Save TA bill in PDF from button in sheet \"Form KVV 6 11\""]
[null,"Save file from button in sheet \"Journey\""]
{"$rows_left_out":2}
{"sheet":"Journey","index":1,"n_rows":366,"n_cols":123,"rows_kept":366,"cut":false,"hidden":true,"merged":[[0,0,0,1],[0,2,0,5],[3,2,3,5],[2,2,2,6],[3,8,3,9],[4,0,5,1],[4,2,5,2],[4,3,5,3],[4,4,4,9],[4,10,4,11],[4,21,5,21],[0,12,0,13],[4,23,5,23],[5,4,5,6],[5,7,5,9],[4,13,5,13],[4,14,5,14],[4,15,5,15],[4,16,5,16],[4,17,5,17],[4,18,5,18],[4,12,5,12],[4,20,5,20],[3,11,3,13],[3,16,3,17],[3,18,3,19],[46,5,46,6],[47,5,47,6],[48,5,48,6],[4,19,5,19],[0,14,0,15],[1,12,1,13],[43,5,43,6],[44,5,44,6],[45,5,45,6]]}
["Department:",null,"Physiology",null,null,null,"TRAVELING ALLOWANCE BILL",null,null,null,null,"Start Date","End Date",null,"DA",null,{"$f":"CN4","v":"B"},{"$f":"CU4","v":0.8},null,"District","Kangra",null,"GO",null,null,null,null,null,null,null,null,null,null,null,null,null,null,null,null,null,null,null,null,null,null,null,null,null,null,null,null,null,null,null,null,null,null,null,null,null,null,null,null,null,null,null,null,null,null,null,null,null,null,null,null,null,null,null,null,null,null,null,null,null,null,null,null,null,null,null,null,null,null,null,null,null,null,null,null,null,null,null,null,null,null,null,null,null,null,null,null,null,null,null,null,null,null,null,null,null,null,{"$f":"L2","v":"2014-06-01"},{"$f":"M2","v":"2014-07-01"}]
[null,null,null,null,null,null,null,null,null,null,null,"2014-06-01","2014-07-01",null,"Within",{"$f":"INDEX($DI$7:$DK$11,MATCH($DF$13,$DH$7:$DH$11,0),MATCH(O2,$DI$6:$DK$6,0))","v":200},{"$f":"CO4","v":200},{"$f":"CR4","v":0.25},null,null,null,null,"NGO",null,null,null,null,null,null,null,null,null,null,null,null,null,null,null,null,null,null,null,null,null,null,null,null,null,null,null,null,null,null,null,null,null,null,null,null,null,null,null,null,null,null,null,null,null,null,null,null,null,null,null,null,null,null,null,null,null,null,null,null,null,null,null,null,null,null,null,null,null,null,null,null,null,null,null,null,null,null,null,null,null,null,null,null,null,null,null,null,null,null,null,null,null,null,null,null,null,null,{"$f":"DR1+1","v":"2014-06-02"}]
["Name      :",null,"Madan",null,null,null,null,null,null,null,null,{"$f":"TEXT(L2,\"mmmyy\")","v":"Jun14"},{"$f":"IF(L3=N3,\"\",N3)","v":"Jul14"},{"$f":"TEXT(M2,\"mmmyy\")","v":"Jul14"},"Metro",{"$f":"INDEX($DI$7:$DK$11,MATCH($DF$13,$DH$7:$DH$11,0),MATCH(O3,$DI$6:$DK$6,0))","v":350},{"$f":"CV4","v":2},{"$f":"CS4","v":0.25},null,"HQ","Palampur",null,null,null,null,null,null,null,null,null,null,null,null,null,null,null,null,null,null,null,null,null,null,null,null,null,null,null,null,null,null,null,"",null,null,null,null,null,null,null,null,null,null,null,null,null,null,null,null,null,null,null,null,null,null,null,null,null,null,null,null,null,null,null,null,null,null,null,null,null,null,"BO-2008",null,null,null,null,null,null,null,null,null,null,null,null,null,null,null,null,null,null,null,null,null,null,null,null,null,null,null,null,null,{"$f":"IFERROR(IF(DR2+1>$DS$1,\"\",DR2+1),\"\")","v":"2014-06-03"}]
["Designation :",null,"AP",null,null,null,"Pay",40210,"Grade Pay",null,8600,{"$f":"IF(M2-L2<0,\"Error: Check Dates above\",\"\")","v":""},null,null,"Other",{"$f":"INDEX($DI$7:$DK$11,MATCH($DF$13,$DH$7:$DH$11,0),MATCH(O4,$DI$6:$DK$6,0))","v":300},"Tour programme",null,"Tentative",null,null,null,null,null,null,null,null,null,null,null,null,null,null,null,null,null,null,null,null,null,null,null,null,null,null,null,null,null,null,null,null,null,null,null,null,null,null,null,null,null,null,null,null,null,null,null,null,null,null,null,null,null,null,null,null,null,null,null,null,null,null,null,null,null,null,null,null,null,null,null,null,{"$f":"IF(K4>=CN7,CM7,IF(AND(K4>=CN9,K4<CN8),CM8,IF(AND(K4>=CN10,K4<CN9),CM9,IF(AND(K4>=CN11,K4<CN10),CM10,CM11))))","v":"B"},{"$f":"VLOOKUP($Q$1,$CM$7:$CU$11,3,FALSE)","v":200},{"$f":"VLOOKUP($Q$1,$CM$7:$CU$11,4,FALSE)","v":350},{"$f":"VLOOKUP($Q$1,$CM$7:$CU$11,5,FALSE)","v":300},{"$f":"VLOOKUP($Q$1,$CM$7:$CU$11,6,FALSE)","v":0.25},{"$f":"VLOOKUP($Q$1,$CM$7:$CU$11,7,FALSE)","v":0.25},{"$f":"VLOOKUP($Q$1,$CM$7:$CU$11,8,FALSE)","v":330},0.8,2,null,null,null,null,null,null,null,null,null,null,null,null,null,null,null,null,null,null,null,null,null,"2014-06-04"]
["Journey",null,"No. of days","Rs/day","Date & Time",null,null,null,null,null,"Place",null,"Km","Within/outside","Mode of\nTravel","Class","Fare","Boarding free","Lodging free","DA","Purpose","Amount",null,"DA on free B/L",null,null,null,null,0,1,null,null,null,null,"start","time","START",null,null,null,"Stop","time","STOP","Duration","Daily",null,null,null,null,"Daily_lodging","halt","Halt 1/2 DA","Halt DA","Rail Rs",null,"rate","inci","hlt 1/2 DA","hlt DA","jr DA","rate rl / Rod","inci Rail /Road","mil rate","milag fare","1/2 DA","Jur/Halt 1/2 DA","Jur/Halt DA","Road Km","rate","inci","mile rate","Milage Allow","Max Fare","1/2 DA","Jr DA","Halt 1/2 DA","Halt DA","1 day","inci","milag","1/2 DA","full DA",null,null,null,null,null,null,null,null,null,null,"D","A",null,"in","ci",null,"inci",null,null,null,null,null,null,null,null,null,null,null,null,null,"DA",null,null,null,null,null,null,null,null,"2014-06-05"]
[null,null,null,null,"Departure",null,null,"Arrival",null,null,"From","To",null,null,null,null,null,null,null,null,null,null,"Full DA",null,"Room rent","LTA","TTA","Max",null,null,null,null,null,null,null,null,null,null,null,null,null,null,null,null,null,null,null,null,null,null,null,null,null,null,null,null,null,null,null,null,null,null,null,null,null,null,null,null,null,null,null,null,null,null,null,null,null,null,null,null,null,null,null,null,null,null,{"$f":"VLOOKUP(L2,CH7:CK18,4,FALSE)","v":{"$error":"#N/A"}},null,0,null,"Grade","Pay","Within","Metro","Other","Rail","Dept","Load","Air",null,null,null,null,null,null,null,null,null,null,null,null,null,"Metro","Other","Within","Journey","LT",null,null,null,null,"2014-06-06"]
[{"$f":"IF(B7<>\"\",1,\"\")","v":1},"Start",null,null,"2014-06-01",4,null,"2014-06-02",4,"05","Palampur","Dharamshala",40,null,"Bus","Ordinary",40,null,null,{"$f":"IF((BM7+BN7+BO7=0),0,BM7+BN7+BO7)","v":96},"Attend Conference",{"$f":"IF(ISERROR(Q7+T7+C7*D7),\"\",Q7+T7+C7*D7)","v":136},{"$f":"IF(ISERROR(DN7),\"\",DN7)","v":96},{"$f":"IF(AND(R7=\"No\",S7=\"No\"),W7,IF(AND(R7=\"\",S7=\"\"),W7,IF(AND(R7=\"Yes\",S7=\"Yes\"),W7/4,IF(AND(R7=\"Yes\",S7=\"No\"),W7/2,IF(AND(R7=\"No\",S7=\"Yes\"),W7*3/4)))))","v":96},{"$f":"IF(ISERROR(INDEX($DI$44:$DK$48,MATCH($DF$13,$DH$44:$DH$48,0),MATCH(DE7,$DI$43:$DK$43,0))),\"\",INDEX($DI$44:$DK$48,MATCH($DF$13,$DH$44:$DH$48,0),MATCH(DE7,$DI$43:$DK$43,0)))","v":0},{"$f":"IF(ISERROR(INDEX($DI$51:$DK$55,MATCH($DF$13,$DH$51:$DH$55,0),MATCH(DE7,$DI$50:$DK$50,0))),\"\",INDEX($DI$51:$DK$55,MATCH($DF$13,$DH$51:$DH$55,0),MATCH(DE7,$DI$50:$DK$50,0)))","v":0},{"$f":"IF(ISERROR(INDEX($DI$58:$DK$62,MATCH($DF$13,$DH$58:$DH$62,0),MATCH(DE7,$DI$57:$DK$57,0))),\"\",INDEX($DI$58:$DK$62,MATCH($DF$13,$DH$58:$DH$62,0),MATCH(DE7,$DI$57:$DK$57,0)))","v":0},{"$f":"IF(B7=\"Start\",0,IF(B7=\"Cont.\",0,IF(B7=\"Halt\",0,IF(B7=\"Finish\",0,IF(B7=\"Room rent\",Y7,IF(B7=\"LTA\",Z7,IF(B7=\"TTA\",AA7)))))))","v":0},null,null,null,{"$f":"E7","v":"2014-06-01"},{"$f":"IF(F7=0,0,F7)","v":4},{"$f":"IF(G7=0,\"00\",G7)","v":"00"},{"$f":"IF(K7=0,0,AF7)","v":"2014-06-01"},{"$f":"IF(K7=0,0,AG7&\":\"&AH7)","v":"4:00"},{"$f":"IF(AI7=\"\",0,AI7)","v":"2014-06-01"},{"$f":"IF(H7=0,AF7,H7)","v":"2014-06-02"},{"$f":"IF(I7=0,0,I7)","v":4},{"$f":"IF(J7=0,\"00\",J7)","v":"05"},{"$f":"AL7","v":"2014-06-02"},{"$f":"IF(K7=0,0,AM7&\":\"&AN7)","v":"4:05"},{"$f":"AL7&\" \"&AP7","v":"41792 4:05"},{"$f":"IFERROR(IF(B8=\"\",AO7-AK7+AP7-AJ7,IF(B7=\"To & Fro\",AO7-AK7+AP7-AJ7,IF(B8<>\"Start\",AO7-AK7+$AD$5-AJ7,AO7-AK7+AP7-AJ7))),\"\")","v":1.0034722222222221},{"$f":"MOD(AR7,24)","v":1.0034722222222221},{"$f":"IF(AND(AS7>=0.25,AS7<0.5),0.7,IF(AND(AS7>=0.5,AS7<=1),1,IF(AS7>1,INT(AS7)+IF(AS7-INT(AS7)<0.25,0,IF(AND(AS7-INT(AS7)>=0.25,(AS7-INT(AS7)<1)),0.7,0)))))","v":1},{"$f":"INT(AT7)","v":1},{"$f":"AT7-AU7","v":0},{"$f":"IF(AU7=0,AV7*10000%&\"% daily\",IF(AV7>0,AU7&\"+\"&AV7*10000%&\"%daily\",AU7&\" daily\"))","v":"1 daily"},{"$f":"IF(AND(R7=\"No\",S7=\"No\"),BA7,IF(AND(R7=\"\",S7=\"\"),BA7,IF(AND(R7=\"Yes\",S7=\"Yes\"),BA7/4,IF(AND(R7=\"Yes\",S7=\"No\"),BA7/2,IF(AND(R7=\"No\",S7=\"Yes\"),BA7*3/4)))))","v":0},{"$f":"IF(B7=\"Halt\",AR7,0)","v":0},{"$f":"IF(AND(AY7>0.25,AY7<=0.5),X7*0.7,0)","v":0},{"$f":"IF(AY7>1,INT(AY7)*X7+IF((AY7-INT(AY7))>0.25,X7*0.7,0),0)+IF(AND(AY7<=1,AY7>0.5),X7,0)","v":0},{"$f":"IF(O7<>\"Train\",0,IF(AND(BZ7=\"x\",O7=\"Train\"),Q7*2,Q7))","v":0},{"$f":"IF(OR(B7=\"Halt\",BH7>0),0,BB7)","v":0},{"$f":"IF(AND(O7=\"Train\",Q7>0),$R$2,0)","v":0},{"$f":"IF(BZ7=\"x\",2*M7*BD7,M7*BD7)","v":0},{"$f":"IF(AND(O7=\"Train\",M7>8,B7=\"1day&6<hlt<12hr\",BG7=0),X7*0.7,0)","v":0},{"$f":"IF(AND(O7=\"Train\",M7>8,B7=\"1day&hlt>12hr\"),X7,0)","v":0},{"$f":"IF(AND(BZ7=\"x\",O7=\"Train\",Q7+BE7<=X7),X7*AS7)","v":false},{"$f":"IF(BJ7=0,0,MAX(BD7,BQ7))","v":0},{"$f":"IF(OR(AND(BZ7=\"x\",BO7>0),BM7>0,B7=\"Halt\",CD7>0),0,MAX(BE7,CA7))","v":0},{"$f":"IF(AND(BT7>=BU7,BL7>0),BS7,0)","v":0},{"$f":"IF(OR(B7=\"Halt\",CD7>0),0,CB7)","v":0},{"$f":"IF(OR(AND(BZ7=\"x\",BO7>0),CD7>0,BR7>BV7),0,BV7)","v":0},{"$f":"IF(OR(BF7+BE7>X7,BX7+CA7>X7),0,MAX(AZ7,BF7,BX7))","v":0},{"$f":"IF(OR(BF7+BE7>X7,BX7+CA7>X7),X7,MAX(BH7,BA7,CD7)+BY7+BG7)","v":96},{"$f":"IF(O7=\"Train\",0,IF(AND(BZ7=\"x\",M7>8),M7*2,M7))","v":80},{"$f":"IF(BP7>8,$R$3,0)","v":0.25},{"$f":"IF(BP7>8,BP7*BQ7,0)","v":20},{"$f":"IF(BP7=0,0,IF(O7=\"Spl conveyance\",$Q$3,$R$1))","v":0.8},{"$f":"BP7*BS7","v":64},{"$f":"IF(AND(BP7>0,O7<>\"Dept.Vehicle\"),IF(BZ7=\"x\",MAX(Q7*2,BT7),MAX(Q7,BT7)),0)","v":80},{"$f":"IF(OR(AND(BP7>=32,BZ7=\"x\"),AND(M7>8,BZ7=\"x\",O7=\"Dept.Vehicle\")),X7*0.7,0)","v":67.199999999999989},{"$f":"IF(AND(M7>8,O7<>\"Train\",O7<>\"Dept.Vehicle\",BZ7=\"x\"),IF(AR7>1,INT(AR7)*X7+IF((AR7-INT(AR7))>0.5,X7*0.7,0),0)+IF(AND(AR7<=1,AR7>0.5),X7,0))","v":96},{"$f":"IF(AND(BP7>8,B7=\"1day&6<hlt<12hr\"),X7*0.7,0)","v":0},{"$f":"IF(AND(BP7>8,B7=\"1day&hlt>12hr\"),X7,0)","v":0},{"$f":"IF(AR7>=0.25,\"x\",0)","v":"x"},{"$f":"IF(AND(BZ7=\"x\",OR(BR7+BU7>BW7,BR7>BV7)),BR7,IF(BZ7=0,BR7,0))","v":20},{"$f":"IF(AND(BZ7=\"x\",BP7>8,OR(BR7+BU7>BW7,BR7>BV7)),BU7,IF(BZ7=0,BU7,0))","v":80},{"$f":"IF(AND(BZ7=\"x\",BP7>32,BR7<BV7,BY7<0),BV7,0)","v":0},{"$f":"IF(AND(BZ7=\"x\",IF(BP7>32,BU7,BR7+BU7)<BW7),BW7,0)","v":96},{"$f":"IF(B7=\"Halt\",K7,IF(B7=\"Start\",L7,IF(OR(B7=\"LTA\",B7=\"TTA\",B7=\"Room_rent\"),K7,L7)))","v":"Dharamshala"},null,null,"Jan",{"$f":"CK7&\"-\"&$CI$6&\"-\"&$M$2","v":{"$error":"#N/A"}},"Dept.Vehicle",1,"00","A",10000,250,500,400,0.25,0.25,330,220,null,null,{"$f":"IF(ISERROR(VLOOKUP(K7,FareChart!$B$4:$AB$28,27,FALSE)),0,VLOOKUP(K7,FareChart!$B$4:$AB$28,27,FALSE))","v":1},{"$f":"IF(ISERROR(VLOOKUP(L7,FareChart!$B$4:$AB$28,27,FALSE)),0,VLOOKUP(L7,FareChart!$B$4:$AB$28,27,FALSE))","v":2},{"$f":"IF(CX7<CY7,HLOOKUP(K7,FareChart!$B$3:$AA$28,CY7+1,FALSE),VLOOKUP(K7,FareChart!$B$4:$AA$28,CY7+1,FALSE))","v":40},{"$f":"IF(CX7>CY7,HLOOKUP(K7,FareChart!$B$3:$AA$28,CY7+1,FALSE),VLOOKUP(K7,FareChart!$B$4:$AA$28,CY7+1,FALSE))","v":40},{"$f":"IF(ISERROR(CZ7),\"\",IF(T(CZ7)<>\"\",\"\",CZ7))","v":40},40,{"$f":"IF(OR(B7=\"Start\",B7=\"To & Fro\",B7=\"Cont.\"),\"Journey\",IF(OR(B7=\"Room_rent\",B7=\"LTA\",B7=\"TTA\"),\"LT\",DE7))","v":"Journey"},{"$f":"IF(N7=\"\",\"Within\",N7)","v":"Within"},10000,10001,"A",500,400,250,120,0,{"$f":"INDEX($DI$7:$DM$11,MATCH($DF$13,$DH$7:$DH$11,0),MATCH(DD7,$DI$6:$DM$6,0))","v":96},"Economy","AC Chair Car","Ordinary","2014-06-07"]
[{"$f":"IF(B8<>\"\",1+A7,\"\")","v":""},null,null,null,null,null,null,null,null,null,null,null,null,null,null,null,null,null,null,{"$f":"IF((BM8+BN8+BO8=0),0,BM8+BN8+BO8)","v":0},null,{"$f":"IF(ISERROR(Q8+T8+C8*D8),\"\",Q8+T8+C8*D8)","v":0},{"$f":"IF(ISERROR(DN8),\"\",DN8)","v":200},{"$f":"IF(AND(R8=\"No\",S8=\"No\"),W8,IF(AND(R8=\"\",S8=\"\"),W8,IF(AND(R8=\"Yes\",S8=\"Yes\"),W8/4,IF(AND(R8=\"Yes\",S8=\"No\"),W8/2,IF(AND(R8=\"No\",S8=\"Yes\"),W8*3/4)))))","v":200},{"$f":"IF(ISERROR(INDEX($DI$44:$DK$48,MATCH($DF$13,$DH$44:$DH$48,0),MATCH(DE8,$DI$43:$DK$43,0))),\"\",INDEX($DI$44:$DK$48,MATCH($DF$13,$DH$44:$DH$48,0),MATCH(DE8,$DI$43:$DK$43,0)))","v":0},{"$f":"IF(ISERROR(INDEX($DI$51:$DK$55,MATCH($DF$13,$DH$51:$DH$55,0),MATCH(DE8,$DI$50:$DK$50,0))),\"\",INDEX($DI$51:$DK$55,MATCH($DF$13,$DH$51:$DH$55,0),MATCH(DE8,$DI$50:$DK$50,0)))","v":0},{"$f":"IF(ISERROR(INDEX($DI$58:$DK$62,MATCH($DF$13,$DH$58:$DH$62,0),MATCH(DE8,$DI$57:$DK$57,0))),\"\",INDEX($DI$58:$DK$62,MATCH($DF$13,$DH$58:$DH$62,0),MATCH(DE8,$DI$57:$DK$57,0)))","v":0},{"$f":"IF(B8=\"Start\",0,IF(B8=\"Cont.\",0,IF(B8=\"Halt\",0,IF(B8=\"Finish\",0,IF(B8=\"Room rent\",Y8,IF(B8=\"LTA\",Z8,IF(B8=\"TTA\",AA8)))))))","v":false},null,null,null,{"$f":"E8","v":"00:00:00"},0,"00","00:00:00","00:00:00","00:00:00","00:00:00",0,"00",{"$f":"AL8","v":"00:00:00"},0,"0 0",{"$f":"IF(K8=0,0,IF(OR(B9=\"\",B9=\"To & Fro\"),AO8-AK8+AP8-AJ8,IF(B8=\"To & Fro\",AO7-AK7+AP7-AJ7,IF(AND(B9<>\"Start\",E8<>E7),AO8-AK8+$AD$5-AJ8,AO8-AK8+AP8-AJ8))))","v":0},{"$f":"MOD(AR8,24)","v":0},{"$f":"IF(AND(AS8>=0.25,AS8<0.5),0.7,IF(AND(AS8>=0.5,AS8<=1),1,IF(AS8>1,INT(AS8)+IF(AS8-INT(AS8)<0.25,0,IF(AND(AS8-INT(AS8)>=0.25,(AS8-INT(AS8)<1)),0.7,0)))))","v":false},{"$f":"INT(AT8)","v":0},{"$f":"AT8-AU8","v":0},{"$f":"IF(AU8=0,AV8*10000%&\"% daily\",IF(AV8>0,AU8&\"+\"&AV8*10000%&\"%daily\",AU8&\" daily\"))","v":"0% daily"},0,0,0,{"$f":"IF(AY8>1,INT(AY8)*X8+IF((AY8-INT(AY8))>0.25,X8*0.7,0),0)+IF(AND(AY8<=1,AY8>0.5),X8,0)","v":0},0,0,0,0,0,0,false,{"$f":"IF(BJ8=0,0,MAX(BD8,BQ8))","v":0},0,{"$f":"IF(AND(BT8>BU8,BL8>0),BS8,0)","v":0},0,{"$f":"IF(OR(AND(BZ8=\"x\",BO8>0),CD8>0,BR8>BV8),0,BV8)","v":0},0,0,0,0,{"$f":"IF(BP8>8,BP8*BQ8,0)","v":0},0,{"$f":"BP8*BS8","v":0},0,0,false,0,0,0,{"$f":"IF(AND(BZ8=\"x\",OR(BR8+BU8>BW8,BR8>BV8)),BR8,IF(BZ8=0,BR8,0))","v":0},{"$f":"IF(AND(BZ8=\"x\",BP8>8,OR(BR8+BU8>BW8,BR8>BV8)),BU8,IF(BZ8=0,BU8,0))","v":0},{"$f":"IF(AND(BZ8=\"x\",BP8>32,BR8<BV8,BY8<0),BV8,0)","v":0},{"$f":"IF(AND(BZ8=\"x\",IF(BP8>32,BU8,BR8+BU8)<BW8),BW8,0)","v":0},0,null,null,"Feb",{"$error":"#N/A"},"Spl conveyance",2,"05","B",10000,200,350,300,0.25,0.25,330,220,null,null,{"$f":"IF(ISERROR(VLOOKUP(K8,FareChart!$B$4:$AB$28,27,FALSE)),0,VLOOKUP(K8,FareChart!$B$4:$AB$28,27,FALSE))","v":0},{"$f":"IF(ISERROR(VLOOKUP(L8,FareChart!$B$4:$AB$28,27,FALSE)),0,VLOOKUP(L8,FareChart!$B$4:$AB$28,27,FALSE))","v":0},{"$f":"IF(CX8<CY8,HLOOKUP(K8,FareChart!$B$3:$AA$28,CY8+1,FALSE),VLOOKUP(K8,FareChart!$B$4:$AA$28,CY8+1,FALSE))","v":{"$error":"#N/A"}},{"$f":"IF(CX8>CY8,HLOOKUP(K8,FareChart!$B$3:$AA$28,CY8+1,FALSE),VLOOKUP(K8,FareChart!$B$4:$AA$28,CY8+1,FALSE))","v":{"$error":"#N/A"}},"","","Within","Within",6600,10000,"B",350,300,200,96,0,{"$f":"INDEX($DI$7:$DM$11,MATCH($DF$13,$DH$7:$DH$11,0),MATCH(DD8,$DI$6:$DM$6,0))","v":200},"Business","AC I","AC","2014-06-08"]
[{"$f":"IF(B9<>\"\",1+A8,\"\")","v":""},null,null,null,null,null,null,null,null,null,null,null,null,null,null,null,null,null,null,0,null,0,200,200,0,0,0,false,null,null,null,"00:00:00",0,"00","00:00:00","00:00:00","00:00:00","00:00:00",0,"00","00:00:00",0,"0 0",0,0,false,0,0,"0% daily",0,0,0,0,0,0,0,0,0,0,false,0,0,0,0,0,0,0,0,0,0,0,0,0,0,false,0,0,0,0,0,0,0,0,null,null,"Mar",{"$error":"#N/A"},"Train",3,10,"C",6600,180,250,200,0.25,0.25,330,220,null,null,{"$f":"IF(ISERROR(VLOOKUP(K9,FareChart!$B$4:$AB$28,27,FALSE)),0,VLOOKUP(K9,FareChart!$B$4:$AB$28,27,FALSE))","v":0},{"$f":"IF(ISERROR(VLOOKUP(L9,FareChart!$B$4:$AB$28,27,FALSE)),0,VLOOKUP(L9,FareChart!$B$4:$AB$28,27,FALSE))","v":0},{"$f":"IF(CX9<CY9,HLOOKUP(K9,FareChart!$B$3:$AA$28,CY9+1,FALSE),VLOOKUP(K9,FareChart!$B$4:$AA$28,CY9+1,FALSE))","v":{"$error":"#N/A"}},{"$f":"IF(CX9>CY9,HLOOKUP(K9,FareChart!$B$3:$AA$28,CY9+1,FALSE),VLOOKUP(K9,FareChart!$B$4:$AA$28,CY9+1,FALSE))","v":{"$error":"#N/A"}},"","","Within","Within",5000,6600,"C",250,200,180,84,0,200,null,"AC II","Deluxe","2014-06-09"]
["",null,null,null,null,null,null,null,null,null,null,null,null,null,null,null,null,null,null,0,null,0,200,200,0,0,0,false,null,null,null,"00:00:00",0,"00","00:00:00","00:00:00","00:00:00","00:00:00",0,"00","00:00:00",0,"0 0",0,0,false,0,0,"0% daily",0,0,0,0,0,0,0,0,0,0,false,0,0,0,0,0,0,0,0,0,0,0,0,0,0,false,0,0,0,0,0,0,0,0,null,null,"Apr",{"$error":"#N/A"},"Bus",4,15,"D",5000,160,250,200,0.25,0.25,330,220,null,null,{"$f":"IF(ISERROR(VLOOKUP(K10,FareChart!$B$4:$AB$28,27,FALSE)),0,VLOOKUP(K10,FareChart!$B$4:$AB$28,27,FALSE))","v":0},{"$f":"IF(ISERROR(VLOOKUP(L10,FareChart!$B$4:$AB$28,27,FALSE)),0,VLOOKUP(L10,FareChart!$B$4:$AB$28,27,FALSE))","v":0},{"$f":"IF(CX10<CY10,HLOOKUP(K10,FareChart!$B$3:$AA$28,CY10+1,FALSE),VLOOKUP(K10,FareChart!$B$4:$AA$28,CY10+1,FALSE))","v":{"$error":"#N/A"}},{"$f":"IF(CX10>CY10,HLOOKUP(K10,FareChart!$B$3:$AA$28,CY10+1,FALSE),VLOOKUP(K10,FareChart!$B$4:$AA$28,CY10+1,FALSE))","v":{"$error":"#N/A"}},"","","Within","Within",3000,5000,"D",250,200,160,72,0,200,null,"Three AC",null,"2014-06-10"]
{"$rows_left_out":357}
{"sheet":"FORM KVV 6 11","index":2,"n_rows":80,"n_cols":20,"rows_kept":80,"cut":false,"hidden":true,"merged":[[0,15,0,16],[1,0,1,16],[2,0,2,16],[3,0,3,16],[8,0,8,5],[8,6,12,6],[8,7,8,9],[8,10,8,13],[8,14,12,14],[8,15,12,15],[39,0,39,16],[8,16,12,16],[9,0,9,2],[9,3,9,5],[9,7,12,7],[9,8,12,8],[9,9,12,9],[9,10,11,12],[9,13,11,13],[10,0,12,0],[10,1,12,1],[10,2,12,2],[10,3,12,3],[10,4,12,4],[10,5,12,5],[34,0,34,16],[73,0,73,16],[41,0,41,16],[45,0,45,16],[53,0,53,16],[55,0,55,16],[57,0,57,16],[61,0,61,16],[62,0,62,16],[65,0,65,16],[67,0,67,16],[68,0,68,16],[72,0,72,16]]}
[null,null,null,null,null,null,null,null,null,null,null,null,null,null,null,"FORM KVV 6 11"]
["C.S.K. HIMACHAL PRADESH KRISHI VISHVAVIDYALAYA"]
["(See Rule 6.22 Part-I of the Account Manual)"]
["TRAVELLING ALLOWANCE BILL"]
["District               :",{"$f":"IF(Journey!U1=\"\",\"\",Journey!U1)","v":"Kangra"},null,null,null,null,"Name         :     ",null,{"$f":"IF(Journey!C3=\"\",\"\",Journey!C3)","v":"Madan"},null,null,null,null,null,"Month:",{"$f":"IF(Journey!M3=\"\",Journey!L3,Journey!L3&\"-\"&Journey!M3)","v":"Jun14-Jul14"}]
["Head Quarters    :",{"$f":"IF(Journey!U3=\"\",\"\",Journey!U3)","v":"Palampur"},null,null,null,null,"Designation :",null,{"$f":"IF(Journey!C4=\"\",\"\",Journey!C4)","v":"AP"}]
[null,null,null,null,null,null,"Pay            :",null,{"$f":"\"Rs. \"&Journey!H4&\"/-\"&\"+ Grade Pay Rs.\"&Journey!K4&\"/-\"","v":"Rs. 40210/-+ Grade Pay Rs.8600/-"},null,null,null,null,null,{"$f":"\"Head of service chargeable :\"","v":"Head of service chargeable :"},null,{"$f":"IF(Journey!F47=\"\",\"\",Journey!F47)","v":""}]
[]
["Particulars of journeys & halts",null,null,null,null,null,"Mode of conveyance used","Actual air,rail,bus fare",null,null,"Distance traveled by road or other means",null,null,null,"Total amount","Purpose of journey or halts","Remarks"]
["Departure",null,null,"Arrival",null,null,null,"Class","No. of fares","Amount","For which mileage is admissible",null,null,"Daily allowance claimed/No. of days"]
{"$rows_left_out":71}
{"sheet":"Tour Report","index":3,"n_rows":24,"n_cols":6,"rows_kept":24,"cut":false,"hidden":true,"merged":[[14,5,15,5],[16,5,17,5],[18,5,19,5],[20,5,21,5],[22,5,23,5],[4,5,5,5],[6,5,7,5],[8,5,9,5],[10,5,11,5],[12,5,13,5],[14,4,15,4],[16,0,17,0],[18,0,19,0],[20,0,21,0],[22,0,23,0],[16,2,17,2],[18,2,19,2],[20,2,21,2],[22,2,23,2],[16,4,17,4],[18,4,19,4],[20,4,21,4],[22,4,23,4],[14,0,15,0],[14,2,15,2],[4,4,5,4],[6,4,7,4],[8,4,9,4],[10,4,11,4],[12,4,13,4],[4,2,5,2],[6,2,7,2],[8,2,9,2],[10,2,11,2],[12,2,13,2],[4,0,5,0],[6,0,7,0],[8,0,9,0],[10,0,11,0],[12,0,13,0],[0,0,0,5],[1,0,1,5],[2,0,2,1],[2,2,2,3],[2,4,3,4],[2,5,3,5]]}
[{"$f":"Journey!S4&\" Tour programme of \"&Journey!C3 &\", \"&Journey!C4&\", \" &\"Dept. of \"&Journey!C1","v":"Tentative Tour programme of Madan, AP, Dept. of Physiology"}]
[{"$f":"\"for the month of \"&'FORM KVV 6 11'!P5","v":"for the month of Jun14-Jul14"}]
["FROM",null,"TO",null,"Mode of travel","Purpose of journey"]
["Place","Date & Time","Place","Date & Time"]
[{"$f":"'FORM KVV 6 11'!A16","v":"Palampur"},{"$f":"IF('FORM KVV 6 11'!B16=0,\"\",'FORM KVV 6 11'!B16)","v":"2014-06-01"},{"$f":"'FORM KVV 6 11'!D16","v":"Dharamshala"},{"$f":"IF('FORM KVV 6 11'!E16=0,\"\",'FORM KVV 6 11'!E16)","v":"2014-06-02"},{"$f":"'FORM KVV 6 11'!G16","v":"Bus"},{"$f":"'FORM KVV 6 11'!P16","v":"Attend Conference"}]
[null,{"$f":"IF('FORM KVV 6 11'!C16=0,\"\",'FORM KVV 6 11'!C16)","v":"4:00"},null,{"$f":"IF('FORM KVV 6 11'!F16=0,\"\",'FORM KVV 6 11'!F16)","v":"4:05"}]
[{"$f":"'FORM KVV 6 11'!A17","v":0},{"$f":"IF('FORM KVV 6 11'!B17=0,\"\",'FORM KVV 6 11'!B17)","v":""},{"$f":"'FORM KVV 6 11'!D17","v":0},{"$f":"IF('FORM KVV 6 11'!E17=0,\"\",'FORM KVV 6 11'!E17)","v":""},{"$f":"'FORM KVV 6 11'!G17","v":""},{"$f":"'FORM KVV 6 11'!P17","v":""}]
[null,{"$f":"IF('FORM KVV 6 11'!C17=0,\"\",'FORM KVV 6 11'!C17)","v":""},null,{"$f":"IF('FORM KVV 6 11'!F17=0,\"\",'FORM KVV 6 11'!F17)","v":""}]
[{"$f":"'FORM KVV 6 11'!A18","v":0},{"$f":"IF('FORM KVV 6 11'!B18=0,\"\",'FORM KVV 6 11'!B18)","v":""},{"$f":"'FORM KVV 6 11'!D18","v":0},{"$f":"IF('FORM KVV 6 11'!E18=0,\"\",'FORM KVV 6 11'!E18)","v":""},{"$f":"'FORM KVV 6 11'!G18","v":""},{"$f":"'FORM KVV 6 11'!P18","v":""}]
[null,{"$f":"IF('FORM KVV 6 11'!C18=0,\"\",'FORM KVV 6 11'!C18)","v":""},null,{"$f":"IF('FORM KVV 6 11'!F18=0,\"\",'FORM KVV 6 11'!F18)","v":""}]
{"$rows_left_out":15}
{"sheet":"FareChart","index":4,"n_rows":28,"n_cols":28,"rows_kept":28,"cut":false,"hidden":true,"merged":[]}
[]
[null,"Customise Your Regular Journey points with Distance (kM) and Fare (Rs)"]
[null,"              Rs\n\nKm             ",{"$f":"B4","v":"Palampur"},{"$f":"B5","v":"Dharamshala"},{"$f":"B6","v":"Baijnath"},{"$f":"B7","v":"Paprola"},{"$f":"B8","v":"Nagrota"},{"$f":"B9","v":"Bajaura"},{"$f":"B10","v":"Dhaulakuan"},{"$f":"B11","v":"Berthin"},{"$f":"B12","v":"Shimla"},{"$f":"B13","v":"Kukumseri"},{"$f":"B14","v":"Delhi"},{"$f":"B15","v":"Chamba"},{"$f":"B16","v":"Mandi"},{"$f":"B17","v":"Solan"},{"$f":"B18","v":"Hamirpur"},{"$f":"B19","v":"Una"},{"$f":"B20","v":"Pathankot"},{"$f":"B21","v":"Bilaspur"},{"$f":"B22","v":"Nahan"},{"$f":"B23","v":0},{"$f":"B24","v":0},{"$f":"B25","v":0},{"$f":"B26","v":0},{"$f":"B27","v":0},{"$f":"B28","v":0}]
[null,"Palampur",0,40,18,16,20,null,null,null,210,null,500,null,null,null,null,null,null,null,null,null,null,null,null,null,null,1]
[null,"Dharamshala",40,0,null,null,null,null,null,null,null,null,null,null,null,null,null,null,null,null,null,null,null,null,null,null,null,2]
[null,"Baijnath",18,null,0,null,null,30,20,40,50,80,null,564,null,null,null,null,null,null,null,null,null,null,null,null,null,3]
[null,"Paprola",16,50,null,0,null,null,null,null,null,null,null,null,null,null,null,null,null,null,null,null,null,null,null,null,null,4]
[null,"Nagrota",20,null,null,null,0,null,null,null,null,null,null,null,null,null,null,null,null,null,null,null,null,null,null,null,null,5]
[null,"Bajaura",120,null,null,null,null,0,null,null,null,null,null,null,null,null,null,null,null,null,null,null,null,null,null,null,null,6]
[null,"Dhaulakuan",250,null,null,null,null,null,0,null,null,null,null,null,null,null,null,null,null,null,null,null,null,null,null,null,null,7]
{"$rows_left_out":18}